{"text_format":"1","workbook":"xlsx","n_sheets":8,"sheets":["入力","CSV","決裁","PL","学校","調査","講座","V"],"not_rendered":{"charts":0,"images":0,"macros":1,"external_links":0,"defined_names":12,"comments":0,"pivot_tables":0},"unopened":[],"bounds":{"document_bytes":16777216,"sheet_cells":100000,"rows_first":2000,"rows_last":500,"rows_between":2000,"halvings":0,"cell_chars":16384,"cell_head_chars":4096},"cells_cut":0,"cells_raw":0,"read":"whole","date_system":"1900"}

{"sheet":"入力","index":0,"n_rows":46,"n_cols":26,"rows_kept":46,"cut":false,"hidden":false,"merged":[[5,3,5,7],[12,2,12,5],[12,6,12,7],[7,3,7,5],[11,2,11,3],[9,2,9,3],[1,5,1,7],[7,1,7,2],[14,7,15,7],[1,0,1,4],[13,4,13,5],[2,1,2,25],[3,2,3,3],[3,4,3,6],[5,1,5,2],[11,1,12,1],[13,22,13,24],[13,2,13,3],[14,22,14,24],[14,13,15,14],[13,11,13,12],[14,17,15,18],[14,4,14,5],[14,6,15,6],[14,2,14,3],[15,22,15,24],[13,1,14,1],[13,17,13,18],[13,15,13,16],[13,13,13,14],[13,9,13,10],[14,15,15,16]]}
[]
["　長野県総合教育センター\n    2025_Ver.1",null,null,null,null,"2025 研修講座申込システム",null,null,null,null,null,null,null,null,null,null,null,null,null,null,"問い合わせ先\n企画調査部　0263-53-8802"]
[]
[null,"A","学校情報",null,"※最初に入力してください。"]
[]
[null,"学 校 名"]
[]
[null,"学校長名"]
[]
[null,"B","MENU▶"]
[]
[null,"C","講座申込情報",null,{"$f":"CONCATENATE(TEXT(TODAY(),\"ggge年mm月dd日\"),TEXT(NOW(),\"_hh時mm分ss秒\"),\" 作成\")","v":"令和7年03月21日 13時11分10秒 作成"}]
[null,null,"　クリックしたセルの内容を拡大表示します。▶\n　名前の漢字をご確認ください。",null,null,null,{"$f":"IF(PL!$C$22=1,\"\",IF(PL!$C$24=\"\",\"\",PL!$C$24))","v":""},null,null,{"$f":"COUNTIF(J17:J46,\"○\")","v":0},{"$f":"COUNTIF(K17:K46,\"○\")","v":0}]
[null,"NO",1,null,2,null,3,4,5,"入力Check",null,"対象講座Check",null,"Check",null,"Check",null,"Check",null,"Check"]
[null,null,"氏　名",null,"ﾌﾘｶﾞﾅ (半角)",null,"職名","個人メールアドレス","講座番号","どこか","すべて","講座","対象","申込数確認",null,"講座重複確認",null,"同一内容講座確認",null,"講座名","講座名","サブタイトル","実施日",null,null,"講座"]
{"$rows_left_out":32}
{"sheet":"CSV","index":1,"n_rows":31,"n_cols":9,"rows_kept":31,"cut":false,"hidden":false,"merged":[]}
["通番","学校コード","学校","職員名","ﾌﾘｶﾞﾅ","職名","個人メールアドレス","講座番号・講座名","作成日時"]
[{"$f":"IF($D2=\"\",\"\",ROW()-1)","v":""},{"$f":"IF($D2=\"\",\"\",LEFT(入力!$D$6,3))","v":""},{"$f":"IF($D2=\"\",\"\",RIGHT(入力!$D$6,LEN(入力!$D$6)-4))","v":""},{"$f":"IF(入力!$C17=\"\",\"\",入力!$C17&\" \"&入力!$D17)","v":""},{"$f":"IF(入力!$C17=\"\",\"\",入力!$E17&\" \"&入力!$F17)","v":""},{"$f":"IF($D2=\"\",\"\",入力!$G17)","v":""},{"$f":"IF($D2=\"\",\"\",入力!$H17)","v":""},{"$f":"IF($D2=\"\",\"\",入力!$I17&\" \"&入力!$U17)","v":""},{"$f":"IF($D2=\"\",\"\",TEXT(NOW(),\"ggge年mm月dd日 hｈ:mm:ss\"))","v":""}]
["",{"$f":"IF($D3=\"\",\"\",LEFT(入力!$D$6,3))","v":""},{"$f":"IF($D3=\"\",\"\",RIGHT(入力!$D$6,LEN(入力!$D$6)-4))","v":""},{"$f":"IF(入力!$C18=\"\",\"\",入力!$C18&\" \"&入力!$D18)","v":""},{"$f":"IF(入力!$C18=\"\",\"\",入力!$E18&\" \"&入力!$F18)","v":""},{"$f":"IF($D3=\"\",\"\",入力!$G18)","v":""},{"$f":"IF($D3=\"\",\"\",入力!$H18)","v":""},{"$f":"IF($D3=\"\",\"\",入力!$I18&\" \"&入力!$U18)","v":""}]
["",{"$f":"IF($D4=\"\",\"\",LEFT(入力!$D$6,3))","v":""},{"$f":"IF($D4=\"\",\"\",RIGHT(入力!$D$6,LEN(入力!$D$6)-4))","v":""},{"$f":"IF(入力!$C19=\"\",\"\",入力!$C19&\" \"&入力!$D19)","v":""},{"$f":"IF(入力!$C19=\"\",\"\",入力!$E19&\" \"&入力!$F19)","v":""},{"$f":"IF($D4=\"\",\"\",入力!$G19)","v":""},{"$f":"IF($D4=\"\",\"\",入力!$H19)","v":""},{"$f":"IF($D4=\"\",\"\",入力!$I19&\" \"&入力!$U19)","v":""}]
["",{"$f":"IF($D5=\"\",\"\",LEFT(入力!$D$6,3))","v":""},{"$f":"IF($D5=\"\",\"\",RIGHT(入力!$D$6,LEN(入力!$D$6)-4))","v":""},{"$f":"IF(入力!$C20=\"\",\"\",入力!$C20&\" \"&入力!$D20)","v":""},{"$f":"IF(入力!$C20=\"\",\"\",入力!$E20&\" \"&入力!$F20)","v":""},{"$f":"IF($D5=\"\",\"\",入力!$G20)","v":""},{"$f":"IF($D5=\"\",\"\",入力!$H20)","v":""},{"$f":"IF($D5=\"\",\"\",入力!$I20&\" \"&入力!$U20)","v":""}]
["",{"$f":"IF($D6=\"\",\"\",LEFT(入力!$D$6,3))","v":""},{"$f":"IF($D6=\"\",\"\",RIGHT(入力!$D$6,LEN(入力!$D$6)-4))","v":""},{"$f":"IF(入力!$C21=\"\",\"\",入力!$C21&\" \"&入力!$D21)","v":""},{"$f":"IF(入力!$C21=\"\",\"\",入力!$E21&\" \"&入力!$F21)","v":""},{"$f":"IF($D6=\"\",\"\",入力!$G21)","v":""},{"$f":"IF($D6=\"\",\"\",入力!$H21)","v":""},{"$f":"IF($D6=\"\",\"\",入力!$I21&\" \"&入力!$U21)","v":""}]
["",{"$f":"IF($D7=\"\",\"\",LEFT(入力!$D$6,3))","v":""},{"$f":"IF($D7=\"\",\"\",RIGHT(入力!$D$6,LEN(入力!$D$6)-4))","v":""},{"$f":"IF(入力!$C22=\"\",\"\",入力!$C22&\" \"&入力!$D22)","v":""},{"$f":"IF(入力!$C22=\"\",\"\",入力!$E22&\" \"&入力!$F22)","v":""},{"$f":"IF($D7=\"\",\"\",入力!$G22)","v":""},{"$f":"IF($D7=\"\",\"\",入力!$H22)","v":""},{"$f":"IF($D7=\"\",\"\",入力!$I22&\" \"&入力!$U22)","v":""}]
["",{"$f":"IF($D8=\"\",\"\",LEFT(入力!$D$6,3))","v":""},{"$f":"IF($D8=\"\",\"\",RIGHT(入力!$D$6,LEN(入力!$D$6)-4))","v":""},{"$f":"IF(入力!$C23=\"\",\"\",入力!$C23&\" \"&入力!$D23)","v":""},{"$f":"IF(入力!$C23=\"\",\"\",入力!$E23&\" \"&入力!$F23)","v":""},{"$f":"IF($D8=\"\",\"\",入力!$G23)","v":""},{"$f":"IF($D8=\"\",\"\",入力!$H23)","v":""},{"$f":"IF($D8=\"\",\"\",入力!$I23&\" \"&入力!$U23)","v":""}]
["",{"$f":"IF($D9=\"\",\"\",LEFT(入力!$D$6,3))","v":""},{"$f":"IF($D9=\"\",\"\",RIGHT(入力!$D$6,LEN(入力!$D$6)-4))","v":""},{"$f":"IF(入力!$C24=\"\",\"\",入力!$C24&\" \"&入力!$D24)","v":""},{"$f":"IF(入力!$C24=\"\",\"\",入力!$E24&\" \"&入力!$F24)","v":""},{"$f":"IF($D9=\"\",\"\",入力!$G24)","v":""},{"$f":"IF($D9=\"\",\"\",入力!$H24)","v":""},{"$f":"IF($D9=\"\",\"\",入力!$I24&\" \"&入力!$U24)","v":""}]
["",{"$f":"IF($D10=\"\",\"\",LEFT(入力!$D$6,3))","v":""},{"$f":"IF($D10=\"\",\"\",RIGHT(入力!$D$6,LEN(入力!$D$6)-4))","v":""},{"$f":"IF(入力!$C25=\"\",\"\",入力!$C25&\" \"&入力!$D25)","v":""},{"$f":"IF(入力!$C25=\"\",\"\",入力!$E25&\" \"&入力!$F25)","v":""},{"$f":"IF($D10=\"\",\"\",入力!$G25)","v":""},{"$f":"IF($D10=\"\",\"\",入力!$H25)","v":""},{"$f":"IF($D10=\"\",\"\",入力!$I25&\" \"&入力!$U25)","v":""}]
["",{"$f":"IF($D11=\"\",\"\",LEFT(入力!$D$6,3))","v":""},{"$f":"IF($D11=\"\",\"\",RIGHT(入力!$D$6,LEN(入力!$D$6)-4))","v":""},{"$f":"IF(入力!$C26=\"\",\"\",入力!$C26&\" \"&入力!$D26)","v":""},{"$f":"IF(入力!$C26=\"\",\"\",入力!$E26&\" \"&入力!$F26)","v":""},{"$f":"IF($D11=\"\",\"\",入力!$G26)","v":""},{"$f":"IF($D11=\"\",\"\",入力!$H26)","v":""},{"$f":"IF($D11=\"\",\"\",入力!$I26&\" \"&入力!$U26)","v":""}]
["",{"$f":"IF($D12=\"\",\"\",LEFT(入力!$D$6,3))","v":""},{"$f":"IF($D12=\"\",\"\",RIGHT(入力!$D$6,LEN(入力!$D$6)-4))","v":""},{"$f":"IF(入力!$C27=\"\",\"\",入力!$C27&\" \"&入力!$D27)","v":""},{"$f":"IF(入力!$C27=\"\",\"\",入力!$E27&\" \"&入力!$F27)","v":""},{"$f":"IF($D12=\"\",\"\",入力!$G27)","v":""},{"$f":"IF($D12=\"\",\"\",入力!$H27)","v":""},{"$f":"IF($D12=\"\",\"\",入力!$I27&\" \"&入力!$U27)","v":""}]
["",{"$f":"IF($D13=\"\",\"\",LEFT(入力!$D$6,3))","v":""},{"$f":"IF($D13=\"\",\"\",RIGHT(入力!$D$6,LEN(入力!$D$6)-4))","v":""},{"$f":"IF(入力!$C28=\"\",\"\",入力!$C28&\" \"&入力!$D28)","v":""},{"$f":"IF(入力!$C28=\"\",\"\",入力!$E28&\" \"&入力!$F28)","v":""},{"$f":"IF($D13=\"\",\"\",入力!$G28)","v":""},{"$f":"IF($D13=\"\",\"\",入力!$H28)","v":""},{"$f":"IF($D13=\"\",\"\",入力!$I28&\" \"&入力!$U28)","v":""}]
["",{"$f":"IF($D14=\"\",\"\",LEFT(入力!$D$6,3))","v":""},{"$f":"IF($D14=\"\",\"\",RIGHT(入力!$D$6,LEN(入力!$D$6)-4))","v":""},{"$f":"IF(入力!$C29=\"\",\"\",入力!$C29&\" \"&入力!$D29)","v":""},{"$f":"IF(入力!$C29=\"\",\"\",入力!$E29&\" \"&入力!$F29)","v":""},{"$f":"IF($D14=\"\",\"\",入力!$G29)","v":""},{"$f":"IF($D14=\"\",\"\",入力!$H29)","v":""},{"$f":"IF($D14=\"\",\"\",入力!$I29&\" \"&入力!$U29)","v":""}]
["",{"$f":"IF($D15=\"\",\"\",LEFT(入力!$D$6,3))","v":""},{"$f":"IF($D15=\"\",\"\",RIGHT(入力!$D$6,LEN(入力!$D$6)-4))","v":""},{"$f":"IF(入力!$C30=\"\",\"\",入力!$C30&\" \"&入力!$D30)","v":""},{"$f":"IF(入力!$C30=\"\",\"\",入力!$E30&\" \"&入力!$F30)","v":""},{"$f":"IF($D15=\"\",\"\",入力!$G30)","v":""},{"$f":"IF($D15=\"\",\"\",入力!$H30)","v":""},{"$f":"IF($D15=\"\",\"\",入力!$I30&\" \"&入力!$U30)","v":""}]
{"$rows_left_out":17}
{"sheet":"決裁","index":2,"n_rows":36,"n_cols":6,"rows_kept":36,"cut":false,"hidden":false,"merged":[[4,0,4,5]]}
[null,null,null,null,null,{"$f":"TEXT(NOW(),\"gggee年mm月dd日hh:mm\")&\"作成\"","v":"令和07年03月21日13:11作成"}]
[null,null,null,null,{"$f":"\"学校コード　\"&LEFT(入力!$D$6,3)","v":"学校コード　"}]
[null,null,null,null,{"$f":"\"学 校 名　　\"&IFERROR(RIGHT(入力!$D$6,LEN(入力!$D$6)-4),\"\")","v":"学 校 名　　"}]
[null,null,null,null,{"$f":"\"学校長名　　\"&IF(入力!$D$8=\"\",\"\",入力!$D$8)","v":"学校長名　　"}]
["令和７年度　総合教育センター研修講座申込書（校内決裁_学校保存用）"]
["通番","フリガナ\n氏　名","職名","講座\nコード","講座名","研修日"]
[{"$f":"IF($B7=\"\",\"\",+ROW()-6)","v":""},{"$f":"IF(入力!$C17=\"\",\"\",入力!$E17&\" \"&入力!$F17&CHAR(10)&入力!$C17&\" \"&入力!$D17)","v":""},{"$f":"IF($B7=\"\",\"\",入力!$G17)","v":""},{"$f":"IF($B7=\"\",\"\",IF(入力!$I17<>\"\",入力!$I17,\"\"))","v":""},{"$f":"IF($D7=\"\",\"\",入力!$U17&CHAR(10)&入力!$V17)","v":""},{"$f":"IF(入力!Y17=\"\",TEXT(入力!W17,\"m/d(aaa)\"),TEXT(入力!W17,\"m/d(aaa)\")&\"～\"&TEXT(入力!Y17,\"m/d(aaa)\"))","v":""}]
[{"$f":"IF($B8=\"\",\"\",+ROW()-6)","v":""},{"$f":"IF(入力!$C18=\"\",\"\",入力!$E18&\" \"&入力!$F18&CHAR(10)&入力!$C18&\" \"&入力!$D18)","v":""},{"$f":"IF(B8=\"\",\"\",入力!$G18)","v":""},{"$f":"IF($B8=\"\",\"\",IF(入力!$I18<>\"\",入力!$I18,\"\"))","v":""},{"$f":"IF($D8=\"\",\"\",入力!$U18&CHAR(10)&入力!$V18)","v":""},{"$f":"IF(入力!Y18=\"\",TEXT(入力!W18,\"m/d(aaa)\"),TEXT(入力!W18,\"m/d(aaa)\")&\"～\"&TEXT(入力!Y18,\"m/d(aaa)\"))","v":""}]
["",{"$f":"IF(入力!$C19=\"\",\"\",入力!$E19&\" \"&入力!$F19&CHAR(10)&入力!$C19&\" \"&入力!$D19)","v":""},{"$f":"IF(B9=\"\",\"\",入力!$G19)","v":""},{"$f":"IF($B9=\"\",\"\",IF(入力!$I19<>\"\",入力!$I19,\"\"))","v":""},{"$f":"IF($D9=\"\",\"\",入力!$U19&CHAR(10)&入力!$V19)","v":""},{"$f":"IF(入力!Y19=\"\",TEXT(入力!W19,\"m/d(aaa)\"),TEXT(入力!W19,\"m/d(aaa)\")&\"～\"&TEXT(入力!Y19,\"m/d(aaa)\"))","v":""}]
["",{"$f":"IF(入力!$C20=\"\",\"\",入力!$E20&\" \"&入力!$F20&CHAR(10)&入力!$C20&\" \"&入力!$D20)","v":""},{"$f":"IF(B10=\"\",\"\",入力!$G20)","v":""},{"$f":"IF($B10=\"\",\"\",IF(入力!$I20<>\"\",入力!$I20,\"\"))","v":""},{"$f":"IF($D10=\"\",\"\",入力!$U20&CHAR(10)&入力!$V20)","v":""},{"$f":"IF(入力!Y20=\"\",TEXT(入力!W20,\"m/d(aaa)\"),TEXT(入力!W20,\"m/d(aaa)\")&\"～\"&TEXT(入力!Y20,\"m/d(aaa)\"))","v":""}]
["",{"$f":"IF(入力!$C21=\"\",\"\",入力!$E21&\" \"&入力!$F21&CHAR(10)&入力!$C21&\" \"&入力!$D21)","v":""},{"$f":"IF(B11=\"\",\"\",入力!$G21)","v":""},{"$f":"IF($B11=\"\",\"\",IF(入力!$I21<>\"\",入力!$I21,\"\"))","v":""},{"$f":"IF($D11=\"\",\"\",入力!$U21&CHAR(10)&入力!$V21)","v":""},{"$f":"IF(入力!Y21=\"\",TEXT(入力!W21,\"m/d(aaa)\"),TEXT(入力!W21,\"m/d(aaa)\")&\"～\"&TEXT(入力!Y21,\"m/d(aaa)\"))","v":""}]
["",{"$f":"IF(入力!$C22=\"\",\"\",入力!$E22&\" \"&入力!$F22&CHAR(10)&入力!$C22&\" \"&入力!$D22)","v":""},{"$f":"IF(B12=\"\",\"\",入力!$G22)","v":""},{"$f":"IF($B12=\"\",\"\",IF(入力!$I22<>\"\",入力!$I22,\"\"))","v":""},{"$f":"IF($D12=\"\",\"\",入力!$U22&CHAR(10)&入力!$V22)","v":""},{"$f":"IF(入力!Y22=\"\",TEXT(入力!W22,\"m/d(aaa)\"),TEXT(入力!W22,\"m/d(aaa)\")&\"～\"&TEXT(入力!Y22,\"m/d(aaa)\"))","v":""}]
["",{"$f":"IF(入力!$C23=\"\",\"\",入力!$E23&\" \"&入力!$F23&CHAR(10)&入力!$C23&\" \"&入力!$D23)","v":""},{"$f":"IF(B13=\"\",\"\",入力!$G23)","v":""},{"$f":"IF($B13=\"\",\"\",IF(入力!$I23<>\"\",入力!$I23,\"\"))","v":""},{"$f":"IF($D13=\"\",\"\",入力!$U23&CHAR(10)&入力!$V23)","v":""},{"$f":"IF(入力!Y23=\"\",TEXT(入力!W23,\"m/d(aaa)\"),TEXT(入力!W23,\"m/d(aaa)\")&\"～\"&TEXT(入力!Y23,\"m/d(aaa)\"))","v":""}]
["",{"$f":"IF(入力!$C24=\"\",\"\",入力!$E24&\" \"&入力!$F24&CHAR(10)&入力!$C24&\" \"&入力!$D24)","v":""},{"$f":"IF(B14=\"\",\"\",入力!$G24)","v":""},{"$f":"IF($B14=\"\",\"\",IF(入力!$I24<>\"\",入力!$I24,\"\"))","v":""},{"$f":"IF($D14=\"\",\"\",入力!$U24&CHAR(10)&入力!$V24)","v":""},{"$f":"IF(入力!Y24=\"\",TEXT(入力!W24,\"m/d(aaa)\"),TEXT(入力!W24,\"m/d(aaa)\")&\"～\"&TEXT(入力!Y24,\"m/d(aaa)\"))","v":""}]
["",{"$f":"IF(入力!$C25=\"\",\"\",入力!$E25&\" \"&入力!$F25&CHAR(10)&入力!$C25&\" \"&入力!$D25)","v":""},{"$f":"IF(B15=\"\",\"\",入力!$G25)","v":""},{"$f":"IF($B15=\"\",\"\",IF(入力!$I25<>\"\",入力!$I25,\"\"))","v":""},{"$f":"IF($D15=\"\",\"\",入力!$U25&CHAR(10)&入力!$V25)","v":""},{"$f":"IF(入力!Y25=\"\",TEXT(入力!W25,\"m/d(aaa)\"),TEXT(入力!W25,\"m/d(aaa)\")&\"～\"&TEXT(入力!Y25,\"m/d(aaa)\"))","v":""}]
{"$rows_left_out":22}
{"sheet":"PL","index":3,"n_rows":24,"n_cols":12,"rows_kept":24,"cut":false,"hidden":false,"merged":[[15,1,15,6],[16,1,16,6]]}
[]
[null,"学校コード",{"$f":"LEFT(入力!D6,3)","v":""},null,null,null,null,null,"Ａ・Ｂ講座、ハイブリッド講座",null,"同内容の講座"]
[null,"学校種",{"$f":"VLOOKUP(入力!D6,school,2,0)","v":{"$error":"#N/A"}},null,null,null,null,null,310503,{"$f":"IF(I3=\"\",\"\",VLOOKUP(I3,kouza,2,FALSE))","v":"子どもの「やってみたい」を引き出す外国語の単元づくり（オンライン）"},{"$f":"IF(I3=\"\",\"\",I3-1)","v":310502},{"$f":"IF(K3=\"\",\"\",VLOOKUP(K3,kouza,2,FALSE))","v":"子どもの「やってみたい」を引き出す外国語の単元づくり"}]
[null,"CSV用文字",{"$f":"VLOOKUP($C$3,$B$9:$C$13,2,0)","v":{"$error":"#N/A"}},null,null,null,null,null,310505,"生徒の学びから考える外国語の授業づくり（オンライン）",{"$f":"IF(I4=\"\",\"\",I4-1)","v":310504},"生徒の学びから考える外国語の授業づくり"]
[null,"CSV用学校名",{"$f":"VLOOKUP(入力!D6,school,3,0)","v":{"$error":"#N/A"}},null,null,null,null,null,360222,"通常の学級で学びにくさの壁を壊そう！Ｂ",360221,"通常の学級で学びにくさの壁を壊そう！Ａ"]
[null,null,null,null,null,null,null,null,370122,"授業力向上のためのカリキュラム・マネジメントＢ",370121,"授業力向上のためのカリキュラム・マネジメントＡ"]
[null,null,null,null,null,null,null,null,null,"","",""]
[null,"学校種","CSV用文字",null,null,null,null,null,null,"","",""]
[null,"小","B1",null,null,null,null,null,null,"","",""]
[null,"中","C1",null,null,null,null,null,null,"","",""]
[null,"小中","C2",null,null,null,null,null,null,"","",""]
[null,"高","D1",null,null,null,null,null,null,"","",""]
[null,"中高","D2",null,null,null,null,null,null,"","",""]
[null,null,null,null,null,null,null,null,null,"","",""]
[null,null,null,null,null,null,null,null,null,"","",""]
{"$rows_left_out":10}
{"sheet":"学校","index":4,"n_rows":45,"n_cols":4,"rows_kept":45,"cut":false,"hidden":false,"merged":[]}
[null,1,2,3]
[null,"学校\nｺｰﾄﾞ","校種","アルファベット"]
[1,"401 グリーン・ヒルズ小学校・中学校","小中","greenhills"]
[2,"402 長野日本大学小学校","小","naganonichidai-syo"]
[3,"403 サミットアカデミーエレメンタリースクール長野","小","sae-nagano"]
[4,"404 才教学園小学校・中学校","小中","saikyougakuen"]
[5,"405 インターナショナルスクールオブ長野小学部","小","international"]
[6,"406 サミットアカデミーエレメンタリースクール佐久","小","sae-saku"]
[7,"407 さやか星小学校","小","sayakaboshi"]
[8,"408 大日向小学校・中学校","小中","obinata"]
[9,"409 どんぐり向方小学校・中学校","小中","dongurigakuen"]
[10,"451 長野日本大学中学校","中","naganonichidai-tyu"]
[11,"453 長野清泉女学院中学校","中","seisenjogakuin-tyu"]
[12,"454 文化学園長野中学校","中","bunkagakuennagano-tyu"]
[13,"456 松本国際中学校","中","matsumotokokusai-tyu"]
{"$rows_left_out":31}
{"sheet":"調査","index":5,"n_rows":18,"n_cols":14,"rows_kept":18,"cut":false,"hidden":false,"merged":[[17,1,17,2],[17,3,17,4],[0,9,0,11],[1,1,1,5],[0,3,0,8],[4,6,5,8],[6,6,6,8],[10,1,10,10],[4,1,4,2],[4,3,4,4],[14,1,14,13],[13,3,13,7],[11,3,11,7],[12,3,12,7]]}
[null,null,null,"令和７年度　総合教育センター研修講座　校内申込書",null,null,null,null,null,"令和　７　年　　　月　　　日　"]
[]
[]
[null,"最初に職員情報を入力してください。"]
[null,"氏名",null,"ﾌﾘｶﾞﾅ（半角）",null,"職名","個人メールアドレス"]
[null,"姓","名","姓","名","(ﾌﾟﾙﾀﾞｳﾝ選択)"]
[]
[null,null,null,null,null,null,"※ 個人メールアドレスは、研修に関する追加連絡がある場合に使用します。"]
[]
[null,"申込者１人につき３講座まで申込みができます。他の研修、学校行事等と実施日が重ならないことを確認してください。",null,null,null,null,null,null,null,null,null,null,null,"小中"]
[null,"　申込希望の研修講座",null,null,null,null,null,null,null,null,null,"採 〇","一致","対象"]
[null,"講座番号",null,{"$f":"IF($C12=\"\",\"\",IF(M12=\"×\",\"講座番号を確認してください。\",IF(N12<>\"○\",\"校種が対象外の講座です。\",VLOOKUP($C12,kouza,2,0)&\" \"&VLOOKUP($C12,kouza,3,0))))","v":""},null,null,null,null,{"$f":"IF($C12=\"\",\"\",IF(AND($M12<>\"×\",$N12=\"○\"),VLOOKUP($C12,kouza,4,FALSE),\"\"))","v":""},{"$f":"IF(K12=\"\",\"\",\"～\")","v":""},{"$f":"IF($I12=\"\",\"\",IF(VLOOKUP($C12,kouza,5,FALSE)=I12,\"\",VLOOKUP($C12,kouza,4,FALSE)))","v":""},null,{"$f":"IF($C12=\"\",\"\",IFERROR(MATCH($C12,講座!$C:$C,0)-1,\"×\"))","v":""},{"$f":"IF($M12=\"\",\"\",HLOOKUP($N$10,kouza,$M12,0))","v":""}]
[null,"講座番号",null,{"$f":"IF($C13=\"\",\"\",IF(M13=\"×\",\"講座番号を確認してください。\",IF(N13<>\"○\",\"校種が対象外の講座です。\",VLOOKUP($C13,kouza,2,0)&\" \"&VLOOKUP($C13,kouza,3,0))))","v":""},null,null,null,null,{"$f":"IF($C13=\"\",\"\",IF(AND($M13<>\"×\",$N13=\"○\"),VLOOKUP($C13,kouza,4,FALSE),\"\"))","v":""},{"$f":"IF(K13=\"\",\"\",\"～\")","v":""},{"$f":"IF($I13=\"\",\"\",IF(VLOOKUP($C13,kouza,5,FALSE)=I13,\"\",VLOOKUP($C13,kouza,4,FALSE)))","v":""},null,{"$f":"IF($C13=\"\",\"\",IFERROR(MATCH($C13,講座!$C:$C,0)-1,\"×\"))","v":""},{"$f":"IF($M13=\"\",\"\",HLOOKUP($N$10,kouza,$M13,0))","v":""}]
[null,"講座番号",null,{"$f":"IF($C14=\"\",\"\",IF(M14=\"×\",\"講座番号を確認してください。\",IF(N14<>\"○\",\"校種が対象外の講座です。\",VLOOKUP($C14,kouza,2,0)&\" \"&VLOOKUP($C14,kouza,3,0))))","v":""},null,null,null,null,{"$f":"IF($C14=\"\",\"\",IF(AND($M14<>\"×\",$N14=\"○\"),VLOOKUP($C14,kouza,4,FALSE),\"\"))","v":""},{"$f":"IF(K14=\"\",\"\",\"～\")","v":""},{"$f":"IF($I14=\"\",\"\",IF(VLOOKUP($C14,kouza,5,FALSE)=I14,\"\",VLOOKUP($C14,kouza,4,FALSE)))","v":""},null,{"$f":"IF($C14=\"\",\"\",IFERROR(MATCH($C14,講座!$C:$C,0)-1,\"×\"))","v":""},{"$f":"IF($M14=\"\",\"\",HLOOKUP($N$10,kouza,$M14,0))","v":""}]
[null,"※ 定員に満たなかった研修講座については、５月20日以降に追加募集を行います。追加募集においては、所属長が認める限り申込数に制限はありません。"]
{"$rows_left_out":4}
{"sheet":"講座","index":6,"n_rows":187,"n_cols":13,"rows_kept":187,"cut":false,"hidden":false,"merged":[]}
[null,null,1,2,3,4,5,6,7,8,9,10,11]
[null,"講座の分類","講座番号","講座名","サブタイトル","講座開始日","講座終了日","日数","小","中","小中","高","中高"]
[{"$f":"IF(LEN($D3)<8,\"\",IF(OR(RIGHT($D3,1)=\"Ｂ\",LEFT($D3,LEN($D3)-7)=$D2),\"●\",\"\"))","v":""},"国語・書道",310101,"小学校国語科の授業づくり基礎","～言語活動を通して育成する資質・能力～","2025-06-20","2025-06-20",1,"○",null,"○",null,{"$f":"IF(OR(J3=\"○\",L3=\"○\"),\"○\",\"\")","v":""}]
["","国語・書道",310102,"中学校国語科の授業づくり基礎","～言語活動を通して育成する資質・能力～","2025-07-04","2025-07-04",1,null,"○","○",null,{"$f":"IF(OR(J4=\"○\",L4=\"○\"),\"○\",\"\")","v":"○"}]
["","国語・書道",310121,"資質・能力を育成する高校国語科の授業","～生徒と考える、生徒が考える授業を基に～","2025-06-12","2025-06-12",1,null,"○","○","○","○"]
["","国語・書道",310122,"中学校テストづくり研修","～資質・能力の育成を評価するテストづくり～","2025-08-04","2025-08-04",1,null,"○","○",null,"○"]
["","国語・書道",310123,"塩尻短歌館探訪","～短歌に親しむ芸術の秋～","2025-10-02","2025-10-02",1,"○","○","○","○","○"]
["","国語・書道",310124,"書写・書道　基本","～子どもが喜びを感じる書写・書道へ～","2025-12-05","2025-12-05",1,"○","○","○","○","○"]
["","社会・地歴・公民",310221,"小学校社会科の授業づくり","～「問い」を追究する授業づくり～","2025-06-03","2025-06-03",1,"○",null,"○",null,""]
["","社会・地歴・公民",310222,"中学校社会科の授業づくり","～「問い」を追究する授業づくり～","2025-06-10","2025-06-10",1,null,"○","○",null,"○"]
["","社会・地歴・公民",310223,"高校地理歴史科の授業づくり","～「問い」を追究する授業づくり～","2025-06-23","2025-06-23",1,null,null,null,"○","○"]
["","社会・地歴・公民",310224,"地域素材の教材化Ⅰ","～埋蔵文化財センターを活用した教材研究～","2025-07-03","2025-07-03",1,"○","○","○","○","○"]
["","社会・地歴・公民",310225,"地域素材の教材化Ⅱ","～県立歴史館を活用した教材研究～","2025-07-08","2025-07-08",1,"○","○","○","○","○"]
["","社会・地歴・公民",310226,"中学校・高校公民の授業づくり","～主権者教育を意識した授業～","2025-09-16","2025-09-16",1,null,"○","○","○","○"]
["","算数・数学",310321,"小学校低・中学年算数","～指導主事・専門主事と考え、学び合う授業づくり～","2025-06-19","2025-06-19",1,"○",null,"○",null,""]
{"$rows_left_out":173}
{"sheet":"V","index":7,"n_rows":0,"n_cols":0,"rows_kept":0,"cut":false,"hidden":false,"merged":[]}